Reaction Details
TargetCannabinoid receptor 1
LigandBDBM50211623
Substrate/Competitorn/a
Meas. Tech.ChEMBL_455617 (CHEMBL886398)
Ki 5.8±n/a nM
Citation Lavey, BJKozlowski, JAShankar, BBSpitler, JMZhou, GYang, DYShu, YWong, MKWong, SCShih, NYWu, JMcCombie, SWRizvi, RWolin, RLLunn, CA Optimization of triaryl bis-sulfones as cannabinoid-2 receptor ligands. Bioorg Med Chem Lett17:3760-4 (2007) 
 
Cannabinoid receptor 1
Name:Cannabinoid receptor 1
Type:G Protein-Coupled Receptor (GPCR)
Mol. Mass.:52868.96
Organism:Homo sapiens (Human)
Description:P21554
Residue:472
BDBM50211623
NameBDBM50211623
Synonyms:(S)-N-(1-(4-(4-chloro-2-(2,6-difluorophenylsulfonyl)phenylsulfonyl)phenyl)ethyl)trifluoromethanesulfonamide | CHEMBL246350
TypeSmall organic molecule
Emp. Form.C21H15ClF5NO6S3
Mol. Mass.603.987
SMILESC[C@H](NS(=O)(=O)C(F)(F)F)c1ccc(cc1)S(=O)(=O)c1ccc(Cl)cc1S(=O)(=O)c1c(F)cccc1F