Reaction Details
TargetCannabinoid receptor 1
LigandBDBM50211640
Substrate/Competitorn/a
Meas. Tech.ChEMBL_455617 (CHEMBL886398)
Ki 1099±n/a nM
Citation Lavey, BJKozlowski, JAShankar, BBSpitler, JMZhou, GYang, DYShu, YWong, MKWong, SCShih, NYWu, JMcCombie, SWRizvi, RWolin, RLLunn, CA Optimization of triaryl bis-sulfones as cannabinoid-2 receptor ligands. Bioorg Med Chem Lett17:3760-4 (2007) 
 
Cannabinoid receptor 1
Name:Cannabinoid receptor 1
Type:G Protein-Coupled Receptor (GPCR)
Mol. Mass.:52868.96
Organism:Homo sapiens (Human)
Description:P21554
Residue:472
BDBM50211640
NameBDBM50211640
Synonyms:(S)-trifluoro-N-(1-(4-(2-(2-fluorophenylsulfonyl)-4-(piperazin-1-yl)phenylsulfonyl)phenyl)ethyl)methanesulfonamide | CHEMBL397850
TypeSmall organic molecule
Emp. Form.C25H25F4N3O6S3
Mol. Mass.635.671
SMILESC[C@H](NS(=O)(=O)C(F)(F)F)c1ccc(cc1)S(=O)(=O)c1ccc(cc1S(=O)(=O)c1ccccc1F)N1CCNCC1