Reaction Details
TargetAdenosine receptor A2b
LigandBDBM50211685
Substrate/Competitorn/a
Meas. Tech.ChEMBL_436384 (CHEMBL904692)
Ki 17±n/a nM
Citation Vidal, BNueda, AEsteve, CDomenech, TBenito, SReinoso, RFPont, MCalbet, MLópez, RCadavid, MILoza, MICárdenas, AGodessart, NBeleta, JWarrellow, GRyder, H Discovery and characterization of 4'-(2-furyl)-N-pyridin-3-yl-4,5'-bipyrimidin-2'-amine (LAS38096), a potent, selective, and efficacious A2B adenosine receptor antagonist. J Med Chem50:2732-6 (2007) 
 
Adenosine receptor A2b
Name:Adenosine receptor A2b
Type:G Protein-Coupled Receptor (GPCR)
Mol. Mass.:36341.22
Organism:Homo sapiens (Human)
Description:n/a
Residue:332
BDBM50211685
NameBDBM50211685
Synonyms:4'-(2-furyl)-N-pyridin-3-yl-4,5'-bipyrimidin-2'-amine CHEMBL375293
TypeSmall organic molecule
Emp. Form.C17H12N6O
Mol. Mass.316.3168
SMILESN(c1cccnc1)c1ncc(-c2ccncn2)c(n1)-c1ccco1