Reaction Details
TargetVascular endothelial growth factor receptor 2
LigandBDBM50211983
Substrate/Competitorn/a
Meas. Tech.ChEMBL_447204 (CHEMBL897503)
IC50 18±n/a nM
Citation Kiselyov, ASMilligan, DOuyang, X Novel inhibitors of VEGF receptors-1 and -2 based on azole-5-carboxamide templates. Bioorg Med Chem Lett17:3550-7 (2007) 
 
Vascular endothelial growth factor receptor 2
Name:Vascular endothelial growth factor receptor 2
Type:Receptor Tyrosine Kinase
Mol. Mass.:151510.97
Organism:Homo sapiens (Human)
Description:P35968
Residue:1356
BDBM50211983
NameBDBM50211983
Synonyms:1-(2-(pyridin-4-yl)ethyl)-N-(4-(trifluoromethoxy)phenyl)-1H-pyrazole-5-carboxamide | CHEMBL236205
TypeSmall organic molecule
Emp. Form.C18H15F3N4O2
Mol. Mass.376.3325
SMILESFC(F)(F)Oc1ccc(NC(=O)c2ccnn2CCc2ccncc2)cc1