Reaction Details
TargetVascular endothelial growth factor receptor 1
LigandBDBM50211992
Substrate/Competitorn/a
Meas. Tech.ChEMBL_447203 (CHEMBL897501)
IC50 320±n/a nM
Citation Kiselyov, ASMilligan, DOuyang, X Novel inhibitors of VEGF receptors-1 and -2 based on azole-5-carboxamide templates. Bioorg Med Chem Lett17:3550-7 (2007) 
 
Vascular endothelial growth factor receptor 1
Name:Vascular endothelial growth factor receptor 1
Type:Receptor Tyrosine Kinase
Mol. Mass.:150800.23
Organism:Homo sapiens (Human)
Description:P17948
Residue:1338
BDBM50211992
NameBDBM50211992
Synonyms:CHEMBL236419 | N-(4-(chlorodifluoromethoxy)phenyl)-1-(2-(pyridin-4-yl)ethyl)-1H-pyrazole-5-carboxamide
TypeSmall organic molecule
Emp. Form.C18H15ClF2N4O2
Mol. Mass.392.787
SMILESFC(F)(Cl)Oc1cccc(NC(=O)c2ccnn2CCc2ccncc2)c1