Reaction Details
TargetEstrogen receptor beta
LigandBDBM50212154
Substrate/Competitorn/a
Meas. Tech.ChEMBL_438781 (CHEMBL889119)
Ki 4.11±n/a nM
Citation Richardson, TIFrank, SAWang, MClarke, CAJones, SAYing, BPKohlman, DTWallace, OBShepherd, TADally, RDPalkowitz, ADGeiser, AGBryant, HUHenck, JWCohen, IRRudmann, DGMcCann, DJCoutant, DEOldham, SWHummel, CWFong, KCHinklin, RLewis, GTian, HDodge, JA Structure-activity relationships of SERMs optimized for uterine antagonism and ovarian safety. Bioorg Med Chem Lett17:3544-9 (2007) 
 
Estrogen receptor beta
Name:Estrogen receptor beta
Type:Protein
Mol. Mass.:59238.43
Organism:Homo sapiens (Human)
Description:Q92731
Residue:530
BDBM50212154
NameBDBM50212154
Synonyms:6-(1,1-dioxo-hexahydro-1lambda*6*-thiopyran-4-yl)-5-[4-(2-piperidin-1-yl-ethoxy)-phenoxy]-naphthalen-2-ol | CHEMBL428926
TypeSmall organic molecule
Emp. Form.C28H33NO5S
Mol. Mass.495.63
SMILESOc1ccc2c(Oc3ccc(OCCN4CCCCC4)cc3)c(ccc2c1)C1CCS(=O)(=O)CC1