Reaction Details
TargetEstrogen receptor
LigandBDBM50212155
Substrate/Competitorn/a
Meas. Tech.ChEMBL_438780 (CHEMBL889118)
Ki 0.48±n/a nM
Citation Richardson, TIFrank, SAWang, MClarke, CAJones, SAYing, BPKohlman, DTWallace, OBShepherd, TADally, RDPalkowitz, ADGeiser, AGBryant, HUHenck, JWCohen, IRRudmann, DGMcCann, DJCoutant, DEOldham, SWHummel, CWFong, KCHinklin, RLewis, GTian, HDodge, JA Structure-activity relationships of SERMs optimized for uterine antagonism and ovarian safety. Bioorg Med Chem Lett17:3544-9 (2007) 
 
Estrogen receptor
Name:Estrogen receptor
Type:Protein
Mol. Mass.:66230.44
Organism:Homo sapiens (Human)
Description:P03372
Residue:595
BDBM50212155
NameBDBM50212155
Synonyms:2-(4-(ethylsulfonyl)phenyl)-3-(4-(2-(piperidin-1-yl)ethoxy)phenoxy)benzo[b]thiophen-6-ol | CHEMBL395291
TypeSmall organic molecule
Emp. Form.C29H31NO5S2
Mol. Mass.537.69
SMILESCCS(=O)(=O)c1ccc(cc1)-c1sc2cc(O)ccc2c1Oc1ccc(OCCN2CCCCC2)cc1