Reaction Details
TargetEstrogen receptor
LigandBDBM50212158
Substrate/Competitorn/a
Meas. Tech.ChEMBL_438780 (CHEMBL889118)
Ki 0.57±n/a nM
Citation Richardson, TIFrank, SAWang, MClarke, CAJones, SAYing, BPKohlman, DTWallace, OBShepherd, TADally, RDPalkowitz, ADGeiser, AGBryant, HUHenck, JWCohen, IRRudmann, DGMcCann, DJCoutant, DEOldham, SWHummel, CWFong, KCHinklin, RLewis, GTian, HDodge, JA Structure-activity relationships of SERMs optimized for uterine antagonism and ovarian safety. Bioorg Med Chem Lett17:3544-9 (2007) 
 
Estrogen receptor
Name:Estrogen receptor
Type:Protein
Mol. Mass.:66230.44
Organism:Homo sapiens (Human)
Description:P03372
Residue:595
BDBM50212158
NameBDBM50212158
Synonyms:4-(6-hydroxy-1-(4-(2-(piperidin-1-yl)ethoxy)phenoxy)naphthalen-2-yl)-N,N-dimethylbenzamide | CHEMBL244001
TypeSmall organic molecule
Emp. Form.C32H34N2O4
Mol. Mass.510.6234
SMILESCN(C)C(=O)c1ccc(cc1)-c1ccc2cc(O)ccc2c1Oc1ccc(OCCN2CCCCC2)cc1