Reaction Details
TargetRetinoic acid receptor RXR-alpha
LigandBDBM50212281
Substrate/Competitorn/a
Meas. Tech.ChEMBL_455695 (CHEMBL886478)
EC50>10000±n/a nM
Citation Lagu, BPio, BLebedev, RYang, MPelton, PD RXR-LXR heterodimer modulators for the potential treatment of dyslipidemia. Bioorg Med Chem Lett17:3497-503 (2007) 
 
Retinoic acid receptor RXR-alpha
Name:Retinoic acid receptor RXR-alpha
Type:PROTEIN
Mol. Mass.:50820.38
Organism:Homo sapiens (Human)
Description:ChEMBL_1456363
Residue:462
BDBM50212281
NameBDBM50212281
Synonyms:3-(5-(1-ethyl-4,4,6-trimethyl-2-oxo-1,2,3,4-tetrahydroquinolin-7-yl)furan-2-yl)acrylic acid | CHEMBL246806
TypeSmall organic molecule
Emp. Form.C21H23NO4
Mol. Mass.353.4116
SMILESCCN1C(=O)CC(C)(C)c2cc(C)c(cc12)-c1ccc(\C=C\C(O)=O)o1