Reaction Details
TargetTransient receptor potential cation channel subfamily V member 1
LigandBDBM50133817
Substrate/Competitorn/a
Meas. Tech.ChEMBL_461160 (CHEMBL945105)
IC50 0.600000±n/a nM
Citation Westaway, SM The potential of transient receptor potential vanilloid type 1 channel modulators for the treatment of pain. J Med Chem50:2589-96 (2007) 
 
Transient receptor potential cation channel subfamily V member 1
Name:Transient receptor potential cation channel subfamily V member 1
Type:Protein
Mol. Mass.:94960.75
Organism:Homo sapiens (Human)
Description:Q8NER1
Residue:839
BDBM50133817
NameBDBM50133817
Synonyms:4-(3-Chloro-pyridin-2-yl)-piperazine-1-carboxylic acid (4-tert-butyl-phenyl)-amide CHEMBL441472 | N-(4-tert-butylphenyl)-4-(3-chloropyridin-2-yl)piperazine-1-carboxamide
TypeSmall organic molecule
Emp. Form.C20H25ClN4O
Mol. Mass.372.892
SMILESCC(C)(C)c1ccc(NC(=O)N2CCN(CC2)c2ncccc2Cl)cc1