Reaction Details
TargetTransient receptor potential cation channel subfamily V member 1
LigandBDBM20284
Substrate/Competitorn/a
Meas. Tech.ChEMBL_461158 (CHEMBL944181)
IC50 220±n/a nM
Citation Westaway, SM The potential of transient receptor potential vanilloid type 1 channel modulators for the treatment of pain. J Med Chem50:2589-96 (2007) 
 
Transient receptor potential cation channel subfamily V member 1
Name:Transient receptor potential cation channel subfamily V member 1
Type:Transient Receptor
Mol. Mass.:94956.12
Organism:Rattus norvegicus (rat)
Description:O35433
Residue:838
BDBM20284
NameBDBM20284
Synonyms:CHEMBL391997 Capsazepine N-[2-(4-chlorophenyl)ethyl]-7,8-dihydroxy-2,3,4,5-tetrahydro-1H-2-benzazepine-2-carbothioamide
TypeSmall organic molecule
Emp. Form.C19H21ClN2O2S
Mol. Mass.376.9
SMILESOc1cc2CCCN(Cc2cc1O)C(=S)NCCc1ccc(Cl)cc1