Reaction Details
TargetSodium channel protein type 10 subunit alpha
LigandBDBM50178861
Substrate/Competitorn/a
Meas. Tech.ChEMBL_461200 (CHEMBL926139)
Ki 180±n/a nM
Citation Kyle, DJIlyin, VI Sodium channel blockers. J Med Chem50:2583-8 (2007) 
 
Sodium channel protein type 10 subunit alpha
Name:Sodium channel protein type 10 subunit alpha
Type:Enzyme
Mol. Mass.:220609.21
Organism:Homo sapiens (Human)
Description:Q9Y5Y9
Residue:1956
BDBM50178861
NameBDBM50178861
Synonyms:(1R,2R)-N1-methyl-N1-((2'-sulfamoylbiphenyl-4-yl)methyl)-N2-(4-(trifluoromethoxy)benzyl)cyclopentane-1,2-dicarboxamide CHEMBL205412 trans-cyclopentane-1,2-dicarboxylic acid 1-[methyl-(2'-sulfamoyl-biphenyl-4-ylmethyl)-amide] 2-(4-trifluoromethoxy-benzylamide)
TypeSmall organic molecule
Emp. Form.C29H30F3N3O5S
Mol. Mass.589.626
SMILESCN(Cc1ccc(cc1)-c1ccccc1S(N)(=O)=O)C(=O)[C@@H]1CCC[C@H]1C(=O)NCc1ccc(OC(F)(F)F)cc1