Reaction Details
TargetRetinoic acid receptor RXR-alpha
LigandBDBM50212274
Substrate/Competitorn/a
Meas. Tech.ChEMBL_455725 (CHEMBL887724)
EC50 0.9±n/a nM
Citation Lagu, BLebedev, RPio, BYang, MPelton, PD Dihydro-[1H]-quinolin-2-ones as retinoid X receptor (RXR) agonists for potential treatment of dyslipidemia. Bioorg Med Chem Lett17:3491-6 (2007) 
 
Retinoic acid receptor RXR-alpha
Name:Retinoic acid receptor RXR-alpha
Type:PROTEIN
Mol. Mass.:50820.38
Organism:Homo sapiens (Human)
Description:ChEMBL_1456363
Residue:462
BDBM50212274
NameBDBM50212274
Synonyms:5-((3-(1-ethyl-4,4,6-trimethyl-2-oxo-1,2,3,4-tetrahydroquinolin-7-yl)-4-(trifluoromethoxy)phenyl)methylene)thiazolidine-2,4-dione | CHEMBL248415
TypeSmall organic molecule
Emp. Form.C25H23F3N2O4S
Mol. Mass.504.521
SMILESCCN1C(=O)CC(C)(C)c2cc(C)c(cc12)-c1cc(C=C2SC(O)=NC2=O)ccc1OC(F)(F)F