Reaction Details
TargetProteinase-activated receptor 1
LigandBDBM50212431
Substrate/Competitorn/a
Meas. Tech.ChEMBL_447297 (CHEMBL896330)
IC50 21.5±n/a nM
Citation Clasby, MCChackalamannil, SCzarniecki, MDoller, DEagen, KGreenlee, WJLin, YTagat, JRTsai, HXia, YAhn, HSAgans-Fantuzzi, JBoykow, GChintala, MHsieh, YMcPhail, AT Himbacine derived thrombin receptor antagonists: discovery of a new tricyclic core. Bioorg Med Chem Lett17:3647-51 (2007) 
 
Proteinase-activated receptor 1
Name:Proteinase-activated receptor 1
Type:Protein
Mol. Mass.:47450.07
Organism:Homo sapiens (Human)
Description:P25116
Residue:425
BDBM50212431
NameBDBM50212431
Synonyms:(3aR,4R,9aS,E)-6,8-difluoro-4-(2-(5-(3-(trifluoromethyl)phenyl)pyridin-2-yl)vinyl)-3a,4,9,9a-tetrahydronaphtho[2,3-c]furan-1(3H)-one | CHEMBL232172
TypeSmall organic molecule
Emp. Form.C26H18F5NO2
Mol. Mass.471.4186
SMILESFc1cc(F)c2C[C@H]3[C@H](COC3=O)[C@@H](\C=C\c3ccc(cn3)-c3cccc(c3)C(F)(F)F)c2c1