Reaction Details
TargetProteinase-activated receptor 1
LigandBDBM50212453
Substrate/Competitorn/a
Meas. Tech.ChEMBL_447297 (CHEMBL896330)
IC50 10±n/a nM
Citation Clasby, MCChackalamannil, SCzarniecki, MDoller, DEagen, KGreenlee, WJLin, YTagat, JRTsai, HXia, YAhn, HSAgans-Fantuzzi, JBoykow, GChintala, MHsieh, YMcPhail, AT Himbacine derived thrombin receptor antagonists: discovery of a new tricyclic core. Bioorg Med Chem Lett17:3647-51 (2007) 
 
Proteinase-activated receptor 1
Name:Proteinase-activated receptor 1
Type:Protein
Mol. Mass.:47450.07
Organism:Homo sapiens (Human)
Description:P25116
Residue:425
BDBM50212453
NameBDBM50212453
Synonyms:(3aR,4R,9aS,E)-4-(2-(5-(3-chlorophenyl)pyridin-2-yl)vinyl)-6-fluoro-3a,4,9,9a-tetrahydronaphtho[2,3-c]furan-1(3H)-one | CHEMBL232534
TypeSmall organic molecule
Emp. Form.C25H19ClFNO2
Mol. Mass.419.875
SMILESFc1ccc2C[C@H]3[C@H](COC3=O)[C@@H](\C=C\c3ccc(cn3)-c3cccc(Cl)c3)c2c1