Reaction Details
TargetSerine/threonine-protein kinase Chk1
LigandBDBM50212503
Substrate/Competitorn/a
Meas. Tech.ChEMBL_447306 (CHEMBL896339)
IC50 0.830000±n/a nM
Citation Tong, YClaiborne, APyzytulinska, MTao, ZFStewart, KDKovar, PChen, ZCredo, RBGuan, RMerta, PJZhang, HBouska, JEveritt, EAMurry, BPHickman, DStratton, TJWu, JRosenberg, SHSham, HLSowin, TJLin, NH 1,4-Dihydroindeno[1,2-c]pyrazoles as potent checkpoint kinase 1 inhibitors: extended exploration on phenyl ring substitutions and preliminary ADME/PK studies. Bioorg Med Chem Lett17:3618-23 (2007) 
 
Serine/threonine-protein kinase Chk1
Name:Serine/threonine-protein kinase Chk1
Type:Enzyme Catalytic Domain
Mol. Mass.:54443.02
Organism:Homo sapiens (Human)
Description:gi_166295192
Residue:476
BDBM50212503
NameBDBM50212503
Synonyms:3-(4'-hydroxy-biphenyl-4-yl)-7-methoxy-1,4-dihydro-indeno[1,2-c]pyrazole-6-carboxylic acid (2-pyrrolidin-1-yl-ethyl)-amide | CHEMBL234869
TypeSmall organic molecule
Emp. Form.C30H30N4O3
Mol. Mass.494.5842
SMILESCOc1cc-2c(Cc3c(n[nH]c-23)-c2ccc(cc2)-c2ccc(O)cc2)cc1C(=O)NCCN1CCCC1