Reaction Details
TargetGlutamate receptor ionotropic, NMDA 2B
LigandBDBM50212680
Substrate/Competitorn/a
Meas. Tech.ChEMBL_455781 (CHEMBL887787)
IC50 3670±n/a nM
Citation Nguyen, KTClaiborne, CFMcCauley, JALibby, BEClaremon, DABednar, RAMosser, SDGaul, SLConnolly, TMCondra, CLBednar, BStump, GLLynch, JJKoblan, KSLiverton, NJ Cyclic benzamidines as orally efficacious NR2B-selective NMDA receptor antagonists. Bioorg Med Chem Lett17:3997-4000 (2007) 
 
Glutamate receptor ionotropic, NMDA 2B
Name:Glutamate receptor ionotropic, NMDA 2B
Type:PROTEIN
Mol. Mass.:166375.46
Organism:Homo sapiens (Human)
Description:ChEMBL_1438829
Residue:1484
BDBM50212680
NameBDBM50212680
Synonyms:2-(3-chloro-4-(trifluoromethoxy)phenyl)-5-(3,5-dichlorophenyl)-4,5-dihydro-1H-imidazole | CHEMBL247113
TypeSmall organic molecule
Emp. Form.C16H10Cl3F3N2O
Mol. Mass.409.618
SMILESFC(F)(F)Oc1ccc(cc1Cl)C1=NC(CN1)c1cc(Cl)cc(Cl)c1