Reaction Details
TargetGlutamate receptor ionotropic, NMDA 2B
LigandBDBM50212683
Substrate/Competitorn/a
Meas. Tech.ChEMBL_455781 (CHEMBL887787)
IC50 1976±n/a nM
Citation Nguyen, KTClaiborne, CFMcCauley, JALibby, BEClaremon, DABednar, RAMosser, SDGaul, SLConnolly, TMCondra, CLBednar, BStump, GLLynch, JJKoblan, KSLiverton, NJ Cyclic benzamidines as orally efficacious NR2B-selective NMDA receptor antagonists. Bioorg Med Chem Lett17:3997-4000 (2007) 
 
Glutamate receptor ionotropic, NMDA 2B
Name:Glutamate receptor ionotropic, NMDA 2B
Type:PROTEIN
Mol. Mass.:166375.46
Organism:Homo sapiens (Human)
Description:ChEMBL_1438829
Residue:1484
BDBM50212683
NameBDBM50212683
Synonyms:5-(3-chlorophenyl)-2-(4-(trifluoromethoxy)phenyl)-4,5-dihydro-1H-imidazole | CHEMBL247717
TypeSmall organic molecule
Emp. Form.C16H12ClF3N2O
Mol. Mass.340.727
SMILESFC(F)(F)Oc1ccc(cc1)C1=NC(CN1)c1cccc(Cl)c1