Reaction Details
TargetGlutamate receptor ionotropic, NMDA 2B
LigandBDBM50212689
Substrate/Competitorn/a
Meas. Tech.ChEMBL_455780 (CHEMBL887786)
Ki 4197±n/a nM
Citation Nguyen, KTClaiborne, CFMcCauley, JALibby, BEClaremon, DABednar, RAMosser, SDGaul, SLConnolly, TMCondra, CLBednar, BStump, GLLynch, JJKoblan, KSLiverton, NJ Cyclic benzamidines as orally efficacious NR2B-selective NMDA receptor antagonists. Bioorg Med Chem Lett17:3997-4000 (2007) 
 
Glutamate receptor ionotropic, NMDA 2B
Name:Glutamate receptor ionotropic, NMDA 2B
Type:PROTEIN
Mol. Mass.:166375.46
Organism:Homo sapiens (Human)
Description:ChEMBL_1438829
Residue:1484
BDBM50212689
NameBDBM50212689
Synonyms:(Z)-7-phenyl-2-(4-(trifluoromethoxy)phenyl)-4,5,6,7-tetrahydro-1H-1,3-diazepine | CHEMBL391389
TypeSmall organic molecule
Emp. Form.C18H17F3N2O
Mol. Mass.334.3356
SMILESFC(F)(F)Oc1ccc(cc1)C1=NCCCC(N1)c1ccccc1