Reaction Details
TargetProto-oncogene tyrosine-protein kinase receptor Ret
LigandBDBM50212752
Substrate/Competitorn/a
Meas. Tech.ChEMBL_455801 (CHEMBL887807)
IC50>3000±n/a nM
Citation Rizzi, ECassinelli, GDallavalle, SLanzi, CCincinelli, RNannei, RCuccuru, GZunino, F Synthesis and RET protein kinase inhibitory activity of 3-arylureidobenzylidene-indolin-2-ones. Bioorg Med Chem Lett17:3962-8 (2007) 
 
Proto-oncogene tyrosine-protein kinase receptor Ret
Name:Proto-oncogene tyrosine-protein kinase receptor Ret
Type:Protein
Mol. Mass.:124318.29
Organism:Homo sapiens (Human)
Description:P07949
Residue:1114
BDBM50212752
NameBDBM50212752
Synonyms:(E)-N-(4-((5,6-dimethoxy-2-oxoindolin-3-ylidene)methyl)phenyl)-4-methylpiperazine-1-carboxamide | CHEMBL247713
TypeSmall organic molecule
Emp. Form.C23H26N4O4
Mol. Mass.422.4769
SMILESCOc1cc2NC(=O)\C(=C\c3ccc(NC(=O)N4CCN(C)CC4)cc3)c2cc1OC