Reaction Details
TargetBeta-2 adrenergic receptor
LigandBDBM50213121
Substrate/Competitorn/a
Meas. Tech.ChEMBL_436827 (CHEMBL905129)
Ki 20400±n/a nM
Citation Jozwiak, KKhalid, CTanga, MJBerzetei-Gurske, IJimenez, LKozocas, JAWoo, AZhu, WXiao, RPAbernethy, DRWainer, IW Comparative molecular field analysis of the binding of the stereoisomers of fenoterol and fenoterol derivatives to the beta2 adrenergic receptor. J Med Chem50:2903-15 (2007) 
 
Beta-2 adrenergic receptor
Name:Beta-2 adrenergic receptor
Type:n/a
Mol. Mass.:46461.69
Organism:Homo sapiens (Human)
Description:P07550
Residue:413
BDBM50213121
NameBDBM50213121
Synonyms:(S)-(+)-5-(1-hydroxy-2-phenethylaminoethyl)-1,3-benzenediol US10617654, Compound (S)-7 US9492405, (S)-7 | US9492405, 26
TypeSmall organic molecule
Emp. Form.C16H19NO3
Mol. Mass.273.327
SMILESO[C@H](CNCCc1ccccc1)c1cc(O)cc(O)c1