Reaction Details
TargetBeta-2 adrenergic receptor
LigandBDBM50213111
Substrate/Competitorn/a
Meas. Tech.ChEMBL_436827 (CHEMBL905129)
Ki 6000±n/a nM
Citation Jozwiak, KKhalid, CTanga, MJBerzetei-Gurske, IJimenez, LKozocas, JAWoo, AZhu, WXiao, RPAbernethy, DRWainer, IW Comparative molecular field analysis of the binding of the stereoisomers of fenoterol and fenoterol derivatives to the beta2 adrenergic receptor. J Med Chem50:2903-15 (2007) 
 
Beta-2 adrenergic receptor
Name:Beta-2 adrenergic receptor
Type:n/a
Mol. Mass.:46461.69
Organism:Homo sapiens (Human)
Description:P07550
Residue:413
BDBM50213111
NameBDBM50213111
Synonyms:(R,S)-(-)-5-[1-hydroxy-2-(1-methyl-2-phenylethylamino)ethyl]-1,3-benzenediol US10617654, Compound (R,S)-4
TypeSmall organic molecule
Emp. Form.C17H22N2O3
Mol. Mass.302.3682
SMILESC[C@@H](Cc1ccc(N)cc1)NC[C@H](O)c1cc(O)cc(O)c1