Reaction Details
TargetCannabinoid receptor 2
LigandBDBM50213144
Substrate/Competitorn/a
Meas. Tech.ChEMBL_447434 (CHEMBL896458)
Ki 0.81±n/a nM
Citation Worm, KZhou, QJStabley, GJDeHaven, RNDolle, RE Biaryl cannabinoid mimetics--synthesis and structure-activity relationship. Bioorg Med Chem Lett17:3652-6 (2007) 
 
Cannabinoid receptor 2
Name:Cannabinoid receptor 2
Type:G Protein-Coupled Receptor (GPCR)
Mol. Mass.:39690.94
Organism:Homo sapiens (Human)
Description:P34972
Residue:360
BDBM50213144
NameBDBM50213144
Synonyms:CHEMBL233184 | morpholin-4-yl-acetic acid 4-(1,1-dimethyl-heptyl)-3',5'-dimethyl-biphenyl-2-ylmethyl ester
TypeSmall organic molecule
Emp. Form.C30H43NO3
Mol. Mass.465.6673
SMILESCCCCCCC(C)(C)c1ccc(c(COC(=O)CN2CCOCC2)c1)-c1cc(C)cc(C)c1