Reaction Details
TargetCannabinoid receptor 2
LigandBDBM50213156
Substrate/Competitorn/a
Meas. Tech.ChEMBL_447434 (CHEMBL896458)
Ki 600±n/a nM
Citation Worm, KZhou, QJStabley, GJDeHaven, RNDolle, RE Biaryl cannabinoid mimetics--synthesis and structure-activity relationship. Bioorg Med Chem Lett17:3652-6 (2007) 
 
Cannabinoid receptor 2
Name:Cannabinoid receptor 2
Type:G Protein-Coupled Receptor (GPCR)
Mol. Mass.:39690.94
Organism:Homo sapiens (Human)
Description:P34972
Residue:360
BDBM50213156
NameBDBM50213156
Synonyms:4-(2-hydroxy-1,1-dimethyl-ethyl)-3',5'-dimethyl-biphenyl-2-ol | CHEMBL234016
TypeSmall organic molecule
Emp. Form.C18H22O2
Mol. Mass.270.3661
SMILESCc1cc(C)cc(c1)-c1ccc(cc1O)C(C)(C)CO