Reaction Details
TargetCannabinoid receptor 2
LigandBDBM50213136
Substrate/Competitorn/a
Meas. Tech.ChEMBL_447434 (CHEMBL896458)
Ki 480±n/a nM
Citation Worm, KZhou, QJStabley, GJDeHaven, RNDolle, RE Biaryl cannabinoid mimetics--synthesis and structure-activity relationship. Bioorg Med Chem Lett17:3652-6 (2007) 
 
Cannabinoid receptor 2
Name:Cannabinoid receptor 2
Type:G Protein-Coupled Receptor (GPCR)
Mol. Mass.:39690.94
Organism:Homo sapiens (Human)
Description:P34972
Residue:360
BDBM50213136
NameBDBM50213136
Synonyms:CHEMBL233182 | [4-(1,1-dimethyl-heptyl)-3',5'-dimethyl-biphenyl-2-yl]-methanol
TypeSmall organic molecule
Emp. Form.C24H34O
Mol. Mass.338.5262
SMILESCCCCCCC(C)(C)c1ccc(c(CO)c1)-c1cc(C)cc(C)c1