Reaction Details
TargetCannabinoid receptor 2
LigandBDBM50213176
Substrate/Competitorn/a
Meas. Tech.ChEMBL_447434 (CHEMBL896458)
Ki 7.8±n/a nM
Citation Worm, KZhou, QJStabley, GJDeHaven, RNDolle, RE Biaryl cannabinoid mimetics--synthesis and structure-activity relationship. Bioorg Med Chem Lett17:3652-6 (2007) 
 
Cannabinoid receptor 2
Name:Cannabinoid receptor 2
Type:G Protein-Coupled Receptor (GPCR)
Mol. Mass.:39690.94
Organism:Homo sapiens (Human)
Description:P34972
Residue:360
BDBM50213176
NameBDBM50213176
Synonyms:4-(1,1-dimethyl-heptyl)-2',3'-dimethoxy-biphenyl-2-ol | CHEMBL427843
TypeSmall organic molecule
Emp. Form.C23H32O3
Mol. Mass.356.4984
SMILESCCCCCCC(C)(C)c1ccc(c(O)c1)-c1cccc(OC)c1OC