Reaction Details
TargetCannabinoid receptor 2
LigandBDBM50213172
Substrate/Competitorn/a
Meas. Tech.ChEMBL_447434 (CHEMBL896458)
Ki>1000±n/a nM
Citation Worm, KZhou, QJStabley, GJDeHaven, RNDolle, RE Biaryl cannabinoid mimetics--synthesis and structure-activity relationship. Bioorg Med Chem Lett17:3652-6 (2007) 
 
Cannabinoid receptor 2
Name:Cannabinoid receptor 2
Type:G Protein-Coupled Receptor (GPCR)
Mol. Mass.:39690.94
Organism:Homo sapiens (Human)
Description:P34972
Residue:360
BDBM50213172
NameBDBM50213172
Synonyms:4-(1,1-dimethyl-heptyl)-3',5'-dimethyl-biphenyl-2-carboxylic acid | CHEMBL233007
TypeSmall organic molecule
Emp. Form.C24H32O2
Mol. Mass.352.5097
SMILESCCCCCCC(C)(C)c1ccc(-c2cc(C)cc(C)c2)c(c1)C(O)=O