Reaction Details
TargetCannabinoid receptor 2
LigandBDBM50213169
Substrate/Competitorn/a
Meas. Tech.ChEMBL_447434 (CHEMBL896458)
Ki 45±n/a nM
Citation Worm, KZhou, QJStabley, GJDeHaven, RNDolle, RE Biaryl cannabinoid mimetics--synthesis and structure-activity relationship. Bioorg Med Chem Lett17:3652-6 (2007) 
 
Cannabinoid receptor 2
Name:Cannabinoid receptor 2
Type:G Protein-Coupled Receptor (GPCR)
Mol. Mass.:39690.94
Organism:Homo sapiens (Human)
Description:P34972
Residue:360
BDBM50213169
NameBDBM50213169
Synonyms:4'-(1,1-dimethyl-heptyl)-2'-hydroxy-biphenyl-3-carbonitrile | CHEMBL238119
TypeSmall organic molecule
Emp. Form.C22H27NO
Mol. Mass.321.4559
SMILESCCCCCCC(C)(C)c1ccc(c(O)c1)-c1cccc(c1)C#N