Reaction Details
TargetKappa-type opioid receptor
LigandBDBM50213373
Substrate/Competitorn/a
Meas. Tech.ChEMBL_447458 (CHEMBL896481)
Ki 284±n/a nM
Citation Trabanco, AAAerts, NAlvarez, RMAndrés, JIBoeckx, IFernández, JGómez, AJanssens, FELeenaerts, JEDe Lucas, AIMatesanz, ESteckler, TPullan, S 4-Phenyl-4-[1H-imidazol-2-yl]-piperidine derivatives as non-peptidic selective delta-opioid agonists with potential anxiolytic/antidepressant properties. Part 2. Bioorg Med Chem Lett17:3860-3 (2007) 
 
Kappa-type opioid receptor
Name:Kappa-type opioid receptor
Type:G Protein-Coupled Receptor (GPCR)
Mol. Mass.:42648.76
Organism:Homo sapiens (Human)
Description:P41145
Residue:380
BDBM50213373
NameBDBM50213373
Synonyms:(4-(1-benzyl-1H-imidazol-2-yl)-4-phenylpiperidin-1-yl)(3,5-dimethylphenyl)methanone | CHEMBL392478
TypeSmall organic molecule
Emp. Form.C30H31N3O
Mol. Mass.449.5866
SMILESCc1cc(C)cc(c1)C(=O)N1CCC(CC1)(c1nccn1Cc1ccccc1)c1ccccc1