Reaction Details
TargetMu-type opioid receptor
LigandBDBM50213383
Substrate/Competitorn/a
Meas. Tech.ChEMBL_447457 (CHEMBL896480)
Ki>4652±n/a nM
Citation Trabanco, AAAerts, NAlvarez, RMAndrés, JIBoeckx, IFernández, JGómez, AJanssens, FELeenaerts, JEDe Lucas, AIMatesanz, ESteckler, TPullan, S 4-Phenyl-4-[1H-imidazol-2-yl]-piperidine derivatives as non-peptidic selective delta-opioid agonists with potential anxiolytic/antidepressant properties. Part 2. Bioorg Med Chem Lett17:3860-3 (2007) 
 
Mu-type opioid receptor
Name:Mu-type opioid receptor
Type:G Protein-Coupled Receptor (GPCR)
Mol. Mass.:44789.51
Organism:Homo sapiens (Human)
Description:P35372
Residue:400
BDBM50213383
NameBDBM50213383
Synonyms:4-((2-(1-benzoyl-4-phenylpiperidin-4-yl)-1H-imidazol-1-yl)methyl)-N,N-diethylbenzamide | CHEMBL232549
TypeSmall organic molecule
Emp. Form.C33H36N4O2
Mol. Mass.520.6645
SMILESCCN(CC)C(=O)c1ccc(Cn2ccnc2C2(CCN(CC2)C(=O)c2ccccc2)c2ccccc2)cc1