Reaction Details
TargetKappa-type opioid receptor
LigandBDBM50213376
Substrate/Competitorn/a
Meas. Tech.ChEMBL_447458 (CHEMBL896481)
Ki>4652±n/a nM
Citation Trabanco, AAAerts, NAlvarez, RMAndrés, JIBoeckx, IFernández, JGómez, AJanssens, FELeenaerts, JEDe Lucas, AIMatesanz, ESteckler, TPullan, S 4-Phenyl-4-[1H-imidazol-2-yl]-piperidine derivatives as non-peptidic selective delta-opioid agonists with potential anxiolytic/antidepressant properties. Part 2. Bioorg Med Chem Lett17:3860-3 (2007) 
 
Kappa-type opioid receptor
Name:Kappa-type opioid receptor
Type:G Protein-Coupled Receptor (GPCR)
Mol. Mass.:42648.76
Organism:Homo sapiens (Human)
Description:P41145
Residue:380
BDBM50213376
NameBDBM50213376
Synonyms:2-methoxy-1-(4-phenyl-4-(1-(1-phenylethyl)-1H-imidazol-2-yl)piperidin-1-yl)ethanone | CHEMBL428544
TypeSmall organic molecule
Emp. Form.C25H29N3O2
Mol. Mass.403.5167
SMILESCOCC(=O)N1CCC(CC1)(c1nccn1C(C)c1ccccc1)c1ccccc1