Reaction Details
TargetCannabinoid receptor 1
LigandBDBM50213617
Substrate/Competitorn/a
Meas. Tech.ChEMBL_456160 (CHEMBL888171)
Ki 2020±n/a nM
Citation Kai, HMorioka, YMurashi, TMorita, KShinonome, SNakazato, HKawamoto, KHanasaki, KTakahashi, FMihara, SArai, TAbe, KOkabe, HBaba, TYoshikawa, TTakenaka, H 2-Arylimino-5,6-dihydro-4H-1,3-thiazines as a new class of cannabinoid receptor agonists. Part 1: discovery of CB2 receptor selective compounds. Bioorg Med Chem Lett17:4030-4 (2007) 
 
Cannabinoid receptor 1
Name:Cannabinoid receptor 1
Type:Enzyme
Mol. Mass.:52842.52
Organism:Mus musculus (Mouse)
Description:P47746
Residue:473
BDBM50213617
NameBDBM50213617
Synonyms:(Z)-methyl 2-(2-isopropylphenylimino)-5,5-dimethyl-1,3-thiazinane-3-carbodithioate | CHEMBL232730
TypeSmall organic molecule
Emp. Form.C17H24N2S3
Mol. Mass.352.581
SMILESCSC(=S)N1CC(C)(C)CS\C1=N/c1ccccc1C(C)C