Reaction Details
TargetCannabinoid receptor 1
LigandBDBM50213615
Substrate/Competitorn/a
Meas. Tech.ChEMBL_456158 (CHEMBL888170)
Ki>5000±n/a nM
Citation Kai, HMorioka, YMurashi, TMorita, KShinonome, SNakazato, HKawamoto, KHanasaki, KTakahashi, FMihara, SArai, TAbe, KOkabe, HBaba, TYoshikawa, TTakenaka, H 2-Arylimino-5,6-dihydro-4H-1,3-thiazines as a new class of cannabinoid receptor agonists. Part 1: discovery of CB2 receptor selective compounds. Bioorg Med Chem Lett17:4030-4 (2007) 
 
Cannabinoid receptor 1
Name:Cannabinoid receptor 1
Type:G Protein-Coupled Receptor (GPCR)
Mol. Mass.:52868.96
Organism:Homo sapiens (Human)
Description:P21554
Residue:472
BDBM50213615
NameBDBM50213615
Synonyms:(Z)-ethyl 2-(2-isopropylphenylimino)-5,5-dimethyl-1,3-thiazinane-3-carboxylate | CHEMBL248135
TypeSmall organic molecule
Emp. Form.C18H26N2O2S
Mol. Mass.334.476
SMILESCCOC(=O)N1CC(C)(C)CS\C1=N/c1ccccc1C(C)C