Reaction Details
TargetCannabinoid receptor 2
LigandBDBM50213646
Substrate/Competitorn/a
Meas. Tech.ChEMBL_456157 (CHEMBL888169)
Ki 98±n/a nM
Citation Kai, HMorioka, YMurashi, TMorita, KShinonome, SNakazato, HKawamoto, KHanasaki, KTakahashi, FMihara, SArai, TAbe, KOkabe, HBaba, TYoshikawa, TTakenaka, H 2-Arylimino-5,6-dihydro-4H-1,3-thiazines as a new class of cannabinoid receptor agonists. Part 1: discovery of CB2 receptor selective compounds. Bioorg Med Chem Lett17:4030-4 (2007) 
 
Cannabinoid receptor 2
Name:Cannabinoid receptor 2
Type:G Protein-Coupled Receptor (GPCR)
Mol. Mass.:39690.94
Organism:Homo sapiens (Human)
Description:P34972
Residue:360
BDBM50213646
NameBDBM50213646
Synonyms:(Z)-methyl 2-(2-isopropylphenylimino)-5-methyl-1,3-thiazinane-3-carbodithioate | CHEMBL245453
TypeSmall organic molecule
Emp. Form.C16H22N2S3
Mol. Mass.338.554
SMILESCSC(=S)N1CC(C)CS\C1=N/c1ccccc1C(C)C