Reaction Details
TargetAmine oxidase [flavin-containing] B
LigandBDBM50213676
Substrate/Competitorn/a
Meas. Tech.ChEMBL_436978 (CHEMBL885994)
Ki>100000±n/a nM
Citation Fierro, AOsorio-Olivares, MCassels, BKEdmondson, DESepúlveda-Boza, SReyes-Parada, M Human and rat monoamine oxidase-A are differentially inhibited by (S)-4-alkylthioamphetamine derivatives: insights from molecular modeling studies. Bioorg Med Chem15:5198-206 (2007) 
 
Amine oxidase [flavin-containing] B
Name:Amine oxidase [flavin-containing] B
Type:Protein
Mol. Mass.:58768.76
Organism:Homo sapiens (Human)
Description:P27338
Residue:520
BDBM50213676
NameBDBM50213676
Synonyms:(S)-2-amino-1-(4-ethylthiophenyl)-propane | CHEMBL387777
TypeSmall organic molecule
Emp. Form.C11H17NS
Mol. Mass.195.324
SMILESCCSc1ccc(C[C@H](C)N)cc1