Reaction Details
TargetAmine oxidase [flavin-containing] B
LigandBDBM50213677
Substrate/Competitorn/a
Meas. Tech.ChEMBL_436976 (CHEMBL885992)
Ki 15000000±n/a nM
Citation Fierro, AOsorio-Olivares, MCassels, BKEdmondson, DESepúlveda-Boza, SReyes-Parada, M Human and rat monoamine oxidase-A are differentially inhibited by (S)-4-alkylthioamphetamine derivatives: insights from molecular modeling studies. Bioorg Med Chem15:5198-206 (2007) 
 
Amine oxidase [flavin-containing] B
Name:Amine oxidase [flavin-containing] B
Type:Enzyme
Mol. Mass.:58469.65
Organism:Rattus norvegicus (rat)
Description:P19643
Residue:520
BDBM50213677
NameBDBM50213677
Synonyms:(S)-2-amino-1-(4-propylthiophenyl)-propane | CHEMBL229472
TypeSmall organic molecule
Emp. Form.C12H19NS
Mol. Mass.209.351
SMILESCCCSc1ccc(C[C@H](C)N)cc1