Reaction Details
TargetAmine oxidase [flavin-containing] A
LigandBDBM50213677
Substrate/Competitorn/a
Meas. Tech.ChEMBL_436977 (CHEMBL885993)
Ki 30±n/a nM
Citation Fierro, AOsorio-Olivares, MCassels, BKEdmondson, DESepúlveda-Boza, SReyes-Parada, M Human and rat monoamine oxidase-A are differentially inhibited by (S)-4-alkylthioamphetamine derivatives: insights from molecular modeling studies. Bioorg Med Chem15:5198-206 (2007) 
 
Amine oxidase [flavin-containing] A
Name:Amine oxidase [flavin-containing] A
Type:Protein
Mol. Mass.:59689.53
Organism:Homo sapiens (Human)
Description:P21397
Residue:527
BDBM50213677
NameBDBM50213677
Synonyms:(S)-2-amino-1-(4-propylthiophenyl)-propane | CHEMBL229472
TypeSmall organic molecule
Emp. Form.C12H19NS
Mol. Mass.209.351
SMILESCCCSc1ccc(C[C@H](C)N)cc1