Reaction Details
TargetPeroxisome proliferator-activated receptor delta
LigandBDBM50213701
Substrate/Competitorn/a
Meas. Tech.ChEMBL_438929 (CHEMBL889272)
EC50 0.03±n/a nM
Citation Zhang, RWang, ADeAngelis, APelton, PXu, JZhu, PZhou, LDemarest, KMurray, WVKuo, GH Discovery of para-alkylthiophenoxyacetic acids as a novel series of potent and selective PPARdelta agonists. Bioorg Med Chem Lett17:3855-9 (2007) 
 
Peroxisome proliferator-activated receptor delta
Name:Peroxisome proliferator-activated receptor delta
Type:Enzyme
Mol. Mass.:49910.45
Organism:Homo sapiens (Human)
Description:Q03181
Residue:441
BDBM50213701
NameBDBM50213701
Synonyms:(R)-2-(2-methyl-4-(2-((4-(trifluoromethyl)phenoxy)methyl)butylthio)phenoxy)acetic acid | CHEMBL390005
TypeSmall organic molecule
Emp. Form.C21H23F3O4S
Mol. Mass.428.465
SMILESCC[C@H](COc1ccc(cc1)C(F)(F)F)CSc1ccc(OCC(O)=O)c(C)c1