Reaction Details
TargetCannabinoid receptor 1
LigandBDBM50213886
Substrate/Competitorn/a
Meas. Tech.ChEMBL_447530 (CHEMBL896544)
Ki 6.8±n/a nM
Citation Kai, HMorioka, YTomida, MTakahashi, THattori, MHanasaki, KKoike, KChiba, HShinohara, SKanemasa, TIwamoto, YTakahashi, KYamaguchi, YBaba, TYoshikawa, TTakenaka, H 2-Arylimino-5,6-dihydro-4H-1,3-thiazines as a new class of cannabinoid receptor agonists. Part 2: orally bioavailable compounds. Bioorg Med Chem Lett17:3925-9 (2007) 
 
Cannabinoid receptor 1
Name:Cannabinoid receptor 1
Type:Enzyme
Mol. Mass.:52842.52
Organism:Mus musculus (Mouse)
Description:P47746
Residue:473
BDBM50213886
NameBDBM50213886
Synonyms:3-[(Z)-naphthalen-1-ylimino]-2-thia-4-aza-spiro[5.5]undecane-4-carbodithioic acid methyl ester methyl 3-(naphthalen-1-ylimino)-2-thia-4-azaspiro[5.5]undecane-4-carbodithioate
TypeSmall organic molecule
Emp. Form.C21H24N2S3
Mol. Mass.400.624
SMILESCSC(=S)N1CC2(CCCCC2)CS\C1=N/c1cccc2ccccc12