Reaction Details
TargetHistone deacetylase 6
LigandBDBM50214437
Substrate/Competitorn/a
Meas. Tech.ChEMBL_439077 (CHEMBL889425)
IC50 102±n/a nM
Citation Kozikowski, APChen, YGaysin, AChen, BD'Annibale, MASuto, CMLangley, BC Functional differences in epigenetic modulators-superiority of mercaptoacetamide-based histone deacetylase inhibitors relative to hydroxamates in cortical neuron neuroprotection studies. J Med Chem50:3054-61 (2007) 
 
Histone deacetylase 6
Name:Histone deacetylase 6
Type:Chromatin regulator; hydrolase; repressor
Mol. Mass.:131381.51
Organism:Homo sapiens (Human)
Description:Q9UBN7
Residue:1215
BDBM50214437
NameBDBM50214437
Synonyms:6-(3-adamantan-1-yl-ureido)hexanoic acid hydroxyamide | CHEMBL227118
TypeSmall organic molecule
Emp. Form.C17H29N3O3
Mol. Mass.323.4305
SMILESONC(=O)CCCCCNC(=O)NC12CC3CC(CC(C3)C1)C2