Reaction Details
TargetGamma-aminobutyric acid receptor subunit beta-3
LigandBDBM50214664
Substrate/Competitorn/a
Meas. Tech.ChEMBL_448071 (CHEMBL898326)
Ki 0.659±n/a nM
Citation Alam, MSHuang, JOzoe, FMatsumura, FOzoe, Y Synthesis, 3D-QSAR, and docking studies of 1-phenyl-1H-1,2,3-triazoles as selective antagonists for beta3 over alpha1beta2gamma2 GABA receptors. Bioorg Med Chem15:5090-104 (2007) 
 
Gamma-aminobutyric acid receptor subunit beta-3
Name:Gamma-aminobutyric acid receptor subunit beta-3
Type:PROTEIN
Mol. Mass.:54130.51
Organism:Homo sapiens (Human)
Description:ChEMBL_448071
Residue:473
BDBM50214664
NameBDBM50214664
Synonyms:5-chloromethyl-1-(2,6-dichloro-4-trifluoromethylphenyl)-4-n-propyl-1H-1,2,3-triazole | CHEMBL235623
TypeSmall organic molecule
Emp. Form.C13H11Cl3F3N3
Mol. Mass.372.601
SMILESCCCc1nnn(c1CCl)-c1c(Cl)cc(cc1Cl)C(F)(F)F