Reaction Details
TargetDelta-type opioid receptor
LigandBDBM50214842
Substrate/Competitorn/a
Meas. Tech.ChEMBL_437131 (CHEMBL906528)
Ki>10000±n/a nM
Citation Vergelli, CGiovannoni, MPPieretti, SDi Giannuario, ADal Piaz, VBiagini, PBiancalani, CGraziano, ACesari, N 4-Amino-5-vinyl-3(2H)-pyridazinones and analogues as potent antinociceptive agents: Synthesis, SARs, and preliminary studies on the mechanism of action. Bioorg Med Chem15:5563-75 (2007) 
 
Delta-type opioid receptor
Name:Delta-type opioid receptor
Type:G Protein-Coupled Receptor (GPCR)
Mol. Mass.:40382.98
Organism:Homo sapiens (Human)
Description:Competition binding assays were carried out using membrane preparations from transfected HN9.10 cells that constitutively expressed the delta opioid receptor.
Residue:372
BDBM50214842
NameBDBM50214842
Synonyms:4-amino-2-butyl-6-phenyl-5-vinylpyridazin-3(2H)-one | CHEMBL227079
TypeSmall organic molecule
Emp. Form.C16H19N3O
Mol. Mass.269.3416
SMILESCCCCn1nc(-c2ccccc2)c(C=C)c(N)c1=O