Reaction Details
TargetTyrosine-protein kinase ABL1
LigandBDBM50215054
Substrate/Competitorn/a
Meas. Tech.ChEMBL_456445 (CHEMBL907534)
IC50 1000±n/a nM
Citation Moss, NBreitfelder, SBetageri, RCirillo, PFFadra, THickey, ERKirrane, TKroe, RRMadwed, JNelson, RMPargellis, CAQian, KCRegan, JSwinamer, ATorcellini, C New modifications to the area of pyrazole-naphthyl urea based p38 MAP kinase inhibitors that bind to the adenine/ATP site. Bioorg Med Chem Lett17:4242-7 (2007) 
 
Tyrosine-protein kinase ABL1
Name:Tyrosine-protein kinase ABL1
Type:Enzyme
Mol. Mass.:122897.30
Organism:Homo sapiens (Human)
Description:P00519
Residue:1130
BDBM50215054
NameBDBM50215054
Synonyms:1-(3-tert-butyl-1-p-tolyl-1H-pyrazol-5-yl)-3-(4-(6-(morpholinomethyl)pyridin-3-yl)naphthalen-1-yl)urea | CHEMBL381743
TypeSmall organic molecule
Emp. Form.C35H38N6O2
Mol. Mass.574.7152
SMILESCc1ccc(cc1)-n1nc(cc1NC(=O)Nc1ccc(-c2ccc(CN3CCOCC3)nc2)c2ccccc12)C(C)(C)C