Reaction Details
TargetGonadotropin-releasing hormone receptor
LigandBDBM50215174
Substrate/Competitorn/a
Meas. Tech.ChEMBL_448200 (CHEMBL898460)
Ki 490±n/a nM
Citation Lanier, MCFeher, MAshweek, NJLoweth, CJRueter, JKSlee, DHWilliams, JPZhu, YFSullivan, SKBrown, MS Selection, synthesis, and structure-activity relationship of tetrahydropyrido[4,3-d]pyrimidine-2,4-diones as human GnRH receptor antagonists. Bioorg Med Chem15:5590-603 (2007) 
 
Gonadotropin-releasing hormone receptor
Name:Gonadotropin-releasing hormone receptor
Type:Enzyme
Mol. Mass.:37749.45
Organism:Homo sapiens (Human)
Description:P30968
Residue:328
BDBM50215174
NameBDBM50215174
Synonyms:6-(2,4-dimethylbenzyl)-1-(2,6-difluorobenzyl)-3-((1-(pyridin-2-ylmethyl)piperidin-3-yl)methyl)-5,6,7,8-tetrahydropyrido[4,3-d]pyrimidine-2,4(1H,3H)-dione | CHEMBL236967
TypeSmall organic molecule
Emp. Form.C35H39F2N5O2
Mol. Mass.599.7133
SMILESCc1ccc(CN2CCc3c(C2)c(=O)n(CC2CCCN(Cc4ccccn4)C2)c(=O)n3Cc2c(F)cccc2F)c(C)c1