Reaction Details
TargetGonadotropin-releasing hormone receptor
LigandBDBM50215203
Substrate/Competitorn/a
Meas. Tech.ChEMBL_448200 (CHEMBL898460)
Ki 5±n/a nM
Citation Lanier, MCFeher, MAshweek, NJLoweth, CJRueter, JKSlee, DHWilliams, JPZhu, YFSullivan, SKBrown, MS Selection, synthesis, and structure-activity relationship of tetrahydropyrido[4,3-d]pyrimidine-2,4-diones as human GnRH receptor antagonists. Bioorg Med Chem15:5590-603 (2007) 
 
Gonadotropin-releasing hormone receptor
Name:Gonadotropin-releasing hormone receptor
Type:Enzyme
Mol. Mass.:37749.45
Organism:Homo sapiens (Human)
Description:P30968
Residue:328
BDBM50215203
NameBDBM50215203
Synonyms:1-(2,6-difluorobenzyl)-6-(4-chloro-2-methylbenzyl)-3-(2-(methyl(2-(pyridin-2-yl)ethyl)amino)ethyl)-5,6,7,8-tetrahydropyrido[4,3-d]pyrimidine-2,4(1H,3H)-dione | CHEMBL392605
TypeSmall organic molecule
Emp. Form.C32H34ClF2N5O2
Mol. Mass.594.094
SMILESCN(CCc1ccccn1)CCn1c(=O)c2CN(Cc3ccc(Cl)cc3C)CCc2n(Cc2c(F)cccc2F)c1=O