Reaction Details
TargetMelanocortin receptor 4
LigandBDBM50215833
Substrate/Competitorn/a
Meas. Tech.ChEMBL_447747 (CHEMBL895641)
Ki 7.9±n/a nM
Citation Poitout, LBrault, VSackur, CBernetière, SCamara, JPlas, PRoubert, P Identification of a novel series of benzimidazoles as potent and selective antagonists of the human melanocortin-4 receptor. Bioorg Med Chem Lett17:4464-70 (2007) 
 
Melanocortin receptor 4
Name:Melanocortin receptor 4
Type:Enzyme
Mol. Mass.:36949.50
Organism:Homo sapiens (Human)
Description:P32245
Residue:332
BDBM50215833
NameBDBM50215833
Synonyms:2-(4-acetylphenylamino)-3-(3-(diethylamino)propyl)-N,N-diisopentyl-3H-benzo[d]imidazole-5-carboxamide | CHEMBL394167
TypeSmall organic molecule
Emp. Form.C33H49N5O2
Mol. Mass.547.7745
SMILESCCN(CC)CCCn1c(Nc2ccc(cc2)C(C)=O)nc2ccc(cc12)C(=O)N(CCC(C)C)CCC(C)C