Reaction Details
TargetMelanocortin receptor 5
LigandBDBM50215816
Substrate/Competitorn/a
Meas. Tech.ChEMBL_447750 (CHEMBL895644)
Ki 2200±n/a nM
Citation Poitout, LBrault, VSackur, CBernetière, SCamara, JPlas, PRoubert, P Identification of a novel series of benzimidazoles as potent and selective antagonists of the human melanocortin-4 receptor. Bioorg Med Chem Lett17:4464-70 (2007) 
 
Melanocortin receptor 5
Name:Melanocortin receptor 5
Type:Enzyme
Mol. Mass.:36612.92
Organism:Homo sapiens (Human)
Description:P33032
Residue:325
BDBM50215816
NameBDBM50215816
Synonyms:2-(4-acetylphenylamino)-N,N-diisopentyl-3-(3-(piperidin-1-yl)propyl)-3H-benzo[d]imidazole-5-carboxamide | CHEMBL233135
TypeSmall organic molecule
Emp. Form.C34H49N5O2
Mol. Mass.559.7852
SMILESCC(C)CCN(CCC(C)C)C(=O)c1ccc2nc(Nc3ccc(cc3)C(C)=O)n(CCCN3CCCCC3)c2c1