Reaction Details
TargetPutative sugar transporter
LigandBDBM50179102
Substrate/Competitorn/a
Meas. Tech.ChEMBL_456666 (CHEMBL924047)
Ki 26000±n/a nM
Citation Ionita, MKrishna, SLéo, PMMorin, CPatel, AP Interaction of O-(undec-10-en)-yl-D-glucose derivatives with the Plasmodium falciparum hexose transporter (PfHT). Bioorg Med Chem Lett17:4934-7 (2007) 
 
Putative sugar transporter
Name:Putative sugar transporter
Synonyms:Hexose transporter 1
Type:PROTEIN
Mol. Mass.:56427.07
Organism:Plasmodium falciparum
Description:ChEMBL_456666
Residue:504
BDBM50179102
NameBDBM50179102
TypeSmall organic molecule
Emp. Form.C17H32O6
Mol. Mass.332.4324
SMILESOC[C@H]1OC(O)[C@H](O)[C@@H](OCCCCCCCCCC=C)[C@@H]1O