Reaction Details
TargetSodium channel protein type 9 subunit alpha
LigandBDBM50216675
Substrate/Competitorn/a
Meas. Tech.ChEMBL_456687 (CHEMBL924068)
IC50 32±n/a nM
Citation Hoyt, SBLondon, CGorin, DWyvratt, MJFisher, MHAbbadie, CFelix, JPGarcia, MLLi, XLyons, KAMcGowan, EMacIntyre, DEMartin, WJPriest, BTRitter, ASmith, MMWarren, VAWilliams, BSKaczorowski, GJParsons, WH Discovery of a novel class of benzazepinone Na(v)1.7 blockers: potential treatments for neuropathic pain. Bioorg Med Chem Lett17:4630-4 (2007) 
 
Sodium channel protein type 9 subunit alpha
Name:Sodium channel protein type 9 subunit alpha
Type:Protein
Mol. Mass.:226375.97
Organism:Homo sapiens (Human)
Description:Q15858
Residue:1988
BDBM50216675
NameBDBM50216675
Synonyms:CHEMBL247648 | tert-butyl (R)-3-(2-fluoro-6-(trifluoromethyl)phenyl)-1-((R)-1-isopropyl-2-oxo-2,3,4,5-tetrahydro-1H-benzo[b]azepin-3-ylamino)-1-oxopropan-2-ylcarbamate
TypeSmall organic molecule
Emp. Form.C28H33F4N3O4
Mol. Mass.551.5729
SMILESCC(C)N1c2ccccc2CC[C@@H](NC(=O)[C@@H](Cc2c(F)cccc2C(F)(F)F)NC(=O)OC(C)(C)C)C1=O