Reaction Details
TargetNAD-dependent protein deacetylase sirtuin-3, mitochondrial
LigandBDBM50216690
Substrate/Competitorn/a
Meas. Tech.ChEMBL_437200 (CHEMBL906598)
IC50>50000±n/a nM
Citation Outeiro, TFKontopoulos, EAltmann, SMKufareva, IStrathearn, KEAmore, AMVolk, CBMaxwell, MMRochet, JCMcLean, PJYoung, ABAbagyan, RFeany, MBHyman, BTKazantsev, AG Sirtuin 2 inhibitors rescue alpha-synuclein-mediated toxicity in models of Parkinson's disease. Science317:516-9 (2007) 
 
NAD-dependent protein deacetylase sirtuin-3, mitochondrial
Name:NAD-dependent protein deacetylase sirtuin-3, mitochondrial
Type:Protein
Mol. Mass.:43582.69
Organism:Homo sapiens (Human)
Description:Q9NTG7
Residue:399
BDBM50216690
NameBDBM50216690
Synonyms:2-cyano-3-(5-(2,3-dichlorophenyl)furan-2-yl)-N-(quinolin-8-yl)acrylamide | CHEMBL226027
TypeSmall organic molecule
Emp. Form.C23H13Cl2N3O2
Mol. Mass.434.274
SMILESClc1cccc(-c2ccc(\C=C(/C#N)C(=O)Nc3cccc4cccnc34)o2)c1Cl